{"text_format":"1","workbook":"xlsx","n_sheets":8,"sheets":["Instructions","Expenses Form","Data","Receipts","Validation","Import","Ls_XLB_WorkbookFile","Ls_AgXLB_WorkbookFile"],"not_rendered":{"charts":0,"images":1,"macros":1,"external_links":1,"defined_names":85,"comments":0,"pivot_tables":0},"unopened":[],"bounds":{"document_bytes":16777216,"sheet_cells":100000,"rows_first":2000,"rows_last":500,"rows_between":2000,"halvings":0,"cell_chars":16384,"cell_head_chars":4096},"cells_cut":0,"cells_raw":0,"read":"whole","date_system":"1900"}

{"sheet":"Instructions","index":0,"n_rows":167,"n_cols":6,"rows_kept":167,"cut":false,"hidden":false,"merged":[[166,1,167,21],[17,1,17,3],[13,1,13,6],[104,3,106,21],[108,3,109,21],[82,3,83,21],[88,3,90,21],[92,3,93,21],[85,3,86,21],[98,3,99,21],[62,1,63,21],[67,3,68,21],[71,3,73,21],[75,3,76,21],[79,1,80,21],[153,1,154,21],[1,1,1,21],[42,1,43,21],[33,1,34,21],[50,3,50,21],[56,3,57,21],[5,1,5,4],[6,1,6,4],[7,1,7,3],[8,1,8,3],[9,1,9,2],[10,1,10,2],[11,1,11,3],[12,1,12,3],[14,1,14,3],[16,1,16,3],[15,1,15,3],[156,1,157,21],[160,1,161,21],[163,1,164,21],[120,3,121,21],[129,3,130,21],[138,1,139,21],[143,1,144,21],[149,1,151,21],[146,1,147,21],[141,1,141,21]]}
[]
[null,"NSPCC Volunteers - How to complete your expense claim form"]
[]
[null,"Contents"]
[]
[null,"Before you start - enable macros"]
[null,"Ensuring your expenses are valid"]
[null,"Preparing your receipts"]
[null,"Completing your form"]
[null,"About you"]
[null,"Coding"]
[null,"A. Non-Travel Expenses"]
[null,"B. Subsistence Expenses"]
[null,"C. Taxis, tubes and other non-mileage journey expenses"]
[null,"Additional Comments / Notes"]
[null,"D. Mileage expenses"]
[null,"Submitting your expense claim"]
[null,"Payment of your claim"]
[]
[null,"Before you start - enable macros"]
{"$rows_left_out":148}
{"sheet":"Expenses Form","index":1,"n_rows":74,"n_cols":24,"rows_kept":74,"cut":false,"hidden":false,"merged":[[55,17,56,19],[55,1,60,3],[72,1,72,15],[53,1,53,13],[45,12,45,13],[64,9,64,15],[38,1,38,3],[73,1,73,15],[55,8,55,9],[67,1,67,15],[66,1,66,15],[69,1,69,15],[70,1,70,15],[59,8,60,12],[62,1,62,14],[57,8,57,13],[58,8,58,12],[55,12,55,13],[43,1,44,9],[45,1,45,3],[43,12,43,13],[42,8,42,15],[16,8,16,12],[9,1,9,2],[9,3,9,9],[9,11,9,12],[45,17,45,19],[23,9,23,12],[22,9,22,12],[17,8,17,12],[11,1,11,15],[43,10,43,11],[42,1,42,3],[36,1,36,13],[39,1,40,15],[26,9,26,12],[33,10,33,12],[38,8,38,15],[4,1,5,15],[34,10,34,12],[35,10,35,12],[9,14,9,15],[20,1,20,15],[31,10,31,12],[32,10,32,12],[25,9,25,12],[27,1,27,13],[12,8,12,12],[13,8,13,12],[14,8,14,12],[29,1,29,15],[21,9,21,12],[30,10,30,12],[15,8,15,12],[6,3,6,9],[24,9,24,12],[18,1,18,13],[1,1,1,13],[6,1,6,2],[7,1,7,2],[8,1,8,2],[6,11,6,12],[7,11,7,12],[8,11,8,12],[2,1,2,15],[7,3,7,9],[6,14,6,15],[7,14,7,15],[8,14,8,15],[8,3,8,9]]}
[]
[null,{"$f":"IF(Validation!$C$19>0,Validation!$B$59,IF($S$9=\"Late Submission\",Validation!$B$63,Validation!$B$61))","v":"INCOMPLETE SUBMISSION Please ensure you have completed all necessary cells. Incorrectly completed cells will be shown in red. We are unable to process incomplete claims, if you are having difficulties completing your claim please call NPU on 02920 108132."}]
[null,{"$f":"IF(Receipt_Form_Required>0, Validation!E67,Validation!E68)","v":"RECEIPTS Please attach your receipts to the email generated when you use the Submit Form button to send your claim. Originals of scanned receipts should be retained by the claimant, not sent through to the NPU."}]
[]
[null,"NSPCC VOLUNTEER EXPENSE CLAIM FORM",null,null,null,null,null,null,null,null,null,null,null,null,null,null,null,"Time stamp","2015-06-03T11:15:55","Cost Centre",{"$f":"IF(ISBLANK(O7), \"Multi-Code\", O7)","v":"Multi-Code"}]
[]
[null,"Full Name",null,null,null,null,null,null,null,null,"Authoriser",null,null,"Cost Centre",null,null,null,"Earliest Month Covered",{"$f":"MIN(C14:C18, C23:C27,C32:C36,C49:C53)","v":"00:00:00"},"Unavailable receipts",{"$f":"COUNTIF(N:N, \"Unavailable\")","v":0},"Trading Count",{"$f":"IF(ISBLANK(O7), COUNTIF(E:E, \"F*\"), IF(LEFT(O7, 1)=\"F\", 1, 0))","v":0}]
[null,"Home Address 1","Address Line 1",null,null,null,null,null,null,null,"Submission Date",null,null,"Project",null,null,null,"Latest Month Covered",{"$f":"MAX(C14:C18,C23:C27,C32:C36,C49:C53)","v":"00:00:00"},"Claimant Initials",{"$f":"IF(LEN(Claimant)-LEN(SUBSTITUTE(Claimant,\" \",\"\"))=0,LEFT(Claimant,1),IF(LEN(Claimant)-LEN(SUBSTITUTE(Claimant,\" \",\"\"))=1,LEFT(Claimant,1)&MID(Claimant,FIND(\" \",Claimant)+1,1),LEFT(Claimant,1)&MID(Claimant,FIND(\" \",Claimant)+1,1)&MID(Claimant,FIND(\" \",Claimant,FIND(\" \",Claimant)+1)+1,1)))","v":""},"Total Count",{"$f":"IF(ISBLANK(O7), COUNTA(E:E), 1)-4","v":0}]
[null,"Home Address 2","Address Line 2",null,null,null,null,null,null,null,"Home Town",null,null,"Appeal/Campaign",null,null,null,"Submission Type",{"$f":"IF(COUNTA(C14:C18,C23:C27,C32:C36,C49:C53)<1,\"\",IF($L$8=\"\",IF(TODAY()-MIN($C$14:$C$53)>92,\"Late Submission\",\"Submission Permitted\"),IF($L$8-MIN($C$14:$C$53)>92,\"Late Submission\",\"Submission Permitted\")))","v":""},"Supplier Code",{"$f":"\"CE00\"&J7","v":"CE00"},"Mixed BU",{"$f":"IF(W7>0, IF(W8>W7, TRUE,FALSE), FALSE)","v":false}]
[null,"Email Address","Email Address",null,null,null,null,null,null,null,"Home Post Code",null,null,"Service/Theme",null,null,null,"Today's date",{"$f":"TEXT(TODAY(),\" dd/mm/yyyy\")","v":" 06/08/2018"}]
[]
[null,"A. NON-TRAVEL EXPENSES (for Parking use section C)",null,null,null,null,null,null,null,null,null,null,null,null,null,null,null,"Number of errors",{"$f":"Validation!C19+COUNTIF(X:X, FALSE)","v":8}]
[null,"Item","Date","Account Code","Cost Centre","Project","Appeal","Service/Theme","Description",null,null,null,null,"Receipt available?","Receipt Amount £","Amount Claimed £",null,"Transaction Reference",{"$f":"$U$8&\"-\"&TEXT(Time_Stamp, \"ddmmyy-hhmmss\")","v":"-030615-111555"},null,null,null,"Receipts","Test Limit"]
[null,1,null,null,null,null,null,null,null,null,null,null,null,null,null,null,null,null,null,null,null,null,{"$f":"IF(N14=\"Unavailable\", TRUE, IF(P14>O14, FALSE, TRUE))","v":true},{"$f":"W14","v":true}]
[null,2,null,null,null,null,null,null,null,null,null,null,null,null,null,null,null,null,null,null,null,null,{"$f":"IF(N15=\"Unavailable\", TRUE, IF(P15>O15, FALSE, TRUE))","v":true},{"$f":"W15","v":true}]
[null,3,null,null,null,null,null,null,null,null,null,null,null,null,null,null,null,null,null,null,null,null,true,{"$f":"W16","v":true}]
[null,4,null,null,null,null,null,null,null,null,null,null,null,null,null,null,null,null,null,null,null,null,true,{"$f":"W17","v":true}]
[null,null,null,null,null,null,null,null,null,null,null,null,null,null,null,null,null,null,null,null,null,null,{"$f":"IF(N18=\"Unavailable\", TRUE, IF(P18>O18, FALSE, TRUE))","v":true},{"$f":"W18","v":true}]
[null,null,null,null,null,null,null,null,null,null,null,null,null,null,{"$f":"SUM(O14:O18)","v":0},{"$f":"SUM(P14:P18)","v":0}]
[]
{"$rows_left_out":55}
{"sheet":"Data","index":2,"n_rows":37,"n_cols":14,"rows_kept":37,"cut":false,"hidden":true,"merged":[]}
["Validation & Lists used in expenses form"]
["Please note, the validation works using named ranges - these can be controlled through Name Manager - Control F3"]
[]
[]
["Car Allowances","Engine Size - used in Engine_Size",null,null,"Up to & Inc","Above","Passenger mileage"]
["Drop Down List","Drop Down List","Lookup concatenation for rate & threshold","Threshold","£ per mile","£ per mile"]
["Select_Option"]
["ECOP",null,{"$f":"A8&ECOP","v":"ECOP"},5000,0.28100000000000003,0.14699999999999999,0.05]
["ECUA",null,{"$f":"A9&ECUA","v":"ECUA"},10000,0.45,0.25,0.05]
["None",null,{"$f":"A10&None","v":"None"},10000,0.45,0.25,0.05]
["Regular_Car_User",null,{"$f":"A11&Regular_Car_User","v":"Regular_Car_User"},10000,0.45,0.25,0.05]
["Car_Payment","Petrol engine up to 1400cc",{"$f":"A12&B12","v":"Car_PaymentPetrol engine up to 1400cc"},"N/A",0.12,0.12,0.05]
["Car_Payment","Petrol engine 1401cc and over",{"$f":"A12&B13","v":"Car_PaymentPetrol engine 1401cc and over"},"N/A",0.14699999999999999,0.14699999999999999,0.05]
["Car_Payment","Diesel engine",{"$f":"A12&B14","v":"Car_PaymentDiesel engine"},"N/A",0.12,0.12,0.05]
[]
[]
["Meal Types"]
["Breakfast - before 7am",5]
["Breakfast - overnight stay",5]
["Meal - 4+ hours",5]
{"$rows_left_out":18}
{"sheet":"Receipts","index":3,"n_rows":47,"n_cols":5,"rows_kept":47,"cut":false,"hidden":true,"merged":[[44,0,44,3],[46,0,46,3],[20,0,20,3],[30,0,30,3],[40,0,40,3],[10,0,10,2],[10,3,10,4],[2,0,6,4],[0,0,1,4],[9,0,9,2],[7,3,7,4],[8,3,8,4],[9,3,9,4],[7,0,7,2],[8,0,8,2]]}
["NSPCC VOLUNTEER EXPENSES RECEIPTS FORM"]
[]
["Please post your receipts with this form to the National Processing Unit at NSPCC, Diane Engelhardt House, Unit 2, Treglow Court, Dowlais Road, Cardiff, CF24 5LQ. \n\nPlease ensure that you clearly mark each receipt with the relevant section letter and item number corresponding to each line below e.g. A1 "]
[]
[]
[]
[]
["Full Name",null,null,{"$f":"'Expenses Form'!D7","v":0}]
["Authoriser",null,"Address Line 1",{"$f":"'Expenses Form'!L7","v":0}]
["Claim Submission Date",null,"Address Line 2",{"$f":"'Expenses Form'!L8","v":"00:00:00"}]
["Transaction Reference Number",null,null,{"$f":"'Expenses Form'!S13","v":"-030615-111555"}]
[]
["A. NON-TRAVEL EXPENSES"]
[]
["Item","Date","Acceptable Receipt","Receipt Total","Amount Claimed £"]
[1,{"$f":"IF(ISBLANK('Expenses Form'!C14), \"\", 'Expenses Form'!C14)","v":""},{"$f":"IF(ISBLANK('Expenses Form'!N14), \"\", 'Expenses Form'!N14)","v":""},{"$f":"IF(ISBLANK('Expenses Form'!O14),\"\", 'Expenses Form'!O14)","v":""},{"$f":"IF(ISBLANK('Expenses Form'!P14), \"\", 'Expenses Form'!P14)","v":""}]
[2,{"$f":"IF(ISBLANK('Expenses Form'!C15), \"\", 'Expenses Form'!C15)","v":""},{"$f":"IF(ISBLANK('Expenses Form'!N15), \"\", 'Expenses Form'!N15)","v":""},{"$f":"IF(ISBLANK('Expenses Form'!O15),\"\", 'Expenses Form'!O15)","v":""},{"$f":"IF(ISBLANK('Expenses Form'!P15), \"\", 'Expenses Form'!P15)","v":""}]
[3,{"$f":"IF(ISBLANK('Expenses Form'!C16), \"\", 'Expenses Form'!C16)","v":""},{"$f":"IF(ISBLANK('Expenses Form'!N16), \"\", 'Expenses Form'!N16)","v":""},{"$f":"IF(ISBLANK('Expenses Form'!O16),\"\", 'Expenses Form'!O16)","v":""},{"$f":"IF(ISBLANK('Expenses Form'!P16), \"\", 'Expenses Form'!P16)","v":""}]
[4,{"$f":"IF(ISBLANK('Expenses Form'!C17), \"\", 'Expenses Form'!C17)","v":""},{"$f":"IF(ISBLANK('Expenses Form'!N17), \"\", 'Expenses Form'!N17)","v":""},{"$f":"IF(ISBLANK('Expenses Form'!O17),\"\", 'Expenses Form'!O17)","v":""},{"$f":"IF(ISBLANK('Expenses Form'!P17), \"\", 'Expenses Form'!P17)","v":""}]
[]
{"$rows_left_out":28}
{"sheet":"Validation","index":4,"n_rows":89,"n_cols":61,"rows_kept":89,"cut":false,"hidden":true,"merged":[[58,1,58,24],[60,1,60,24],[62,1,62,24]]}
[]
[null,"Header Validation"]
[]
[null,"Name",{"$f":"IF(ISBLANK('Expenses Form'!D7), 1, 0)","v":1}]
[null,"Authoriser",{"$f":"IF(ISBLANK('Expenses Form'!L7), 1, 0)","v":1}]
[null,"Submission Date",{"$f":"IF(ISBLANK('Expenses Form'!L8), 1, 0)","v":1}]
[null,"Address",{"$f":"IF(ISBLANK('Expenses Form'!D8), 1, 0)","v":1}]
[null,"Town",{"$f":"IF(ISBLANK('Expenses Form'!L9), 1, 0)","v":1}]
[null,"PostCode",{"$f":"IF(ISBLANK('Expenses Form'!L10), 1, 0)","v":1}]
[null,"Email Address",{"$f":"IF(ISBLANK('Expenses Form'!D10), 1, 0)","v":1}]
[null,"Cost Centre",{"$f":"IF(ISBLANK('Expenses Form'!$O$7), IF(SUM(L:L)>0, 1, 0), 0)","v":0}]
[null,"Project",{"$f":"IF(ISBLANK('Expenses Form'!O8), 1, 0)","v":1},null,"Excluded from error check as blank is a valid value"]
[null,"Appeal",{"$f":"IF(ISBLANK('Expenses Form'!O9), 1, 0)","v":1},null,"Excluded from error check as blank is a valid value"]
[null,"Commission",{"$f":"IF(ISBLANK('Expenses Form'!O10), 1, 0)","v":1},null,"Excluded from error check as blank is a valid value"]
[null,"Form <=0",{"$f":"IF(Total_Claim>0, 0, 1)","v":1}]
[null,"Comments",{"$f":"IF(AND(COUNTIF('Expenses Form'!N:N,\"Unavailable\")>0,ISBLANK('Expenses Form'!$B$40)),1,0)","v":0}]
[]
[null,null,null,null,null,null,null,null,null,null,null,null,null,"Excluded from error check ",null,null,"Excluded from error check ",null,null,"Excluded from error check "]
[null,"Total Errors",{"$f":"SUM(C4:C11,C15:C17)+SUM(F:F)+SUM(I:I)+SUM(L:L)+SUM(X:X)+SUM(AA:AA)+SUM(AD:AD)+SUM(AG:AG)+SUM(AJ:AJ)+SUM(AM:AM)+SUM(AT:AT)+SUM(AW:AW)+SUM(AZ:AZ)+SUM(BC:BC)+SUM(BF:BF)+SUM(BI:BI)+SUM(AP:AP)","v":8},null,null,null,null,null,null,null,null,null,null,"as blank is a valid value",null,null,"as blank is a valid value",null,null,"as blank is a valid value"]
[]
{"$rows_left_out":70}
{"sheet":"Import","index":5,"n_rows":45,"n_cols":17,"rows_kept":45,"cut":false,"hidden":true,"merged":[]}
[]
[null,"SunSystems Import Sheet",null,"FORM UPDATED ON THE GREEN - 01/08/2018"]
[null,"This sheet extracts the data required from the expenses form and formats it into a suitable format to be loaded into SunSystems. "]
[]
[null,"1. First log into Q&A and then click the Update Import File button. This sheet will default to manual recalculate because this is what Q&A requires. Therefore to pull the data through from the claim form you need to click here. "]
[]
[null,"2. Key the Supplier Account into the yellow box below and then check the account name is for the correct person. Click the Check Supplier Account button to display the name of the Account to which you are importing. "]
[null,"If the account does not exist, you need to arrange for the supplier to be created before you can import this claim. If the account is for the wrong person, contact the claimant to ensure that the employee number provided is correct. "]
[null,"Check the postcode indicator is TRUE - this shows that the postcode on the supplier record is the same as the one on the form. If not, this may indicate that the volunteer's address has changed and the supplier record needs to be updated. "]
[]
[null,"3. Enter the date the expense claim was received by NPU into the orange field"]
[]
[null,"4. If the account exists, click on the Send Data to SunSystems button to attempt to send the data. Any errors will be displayed as an Excel review note in cell I23. Any comments will be displayed as an Excel review note in cell I24"]
[]
[null,"5. Once you have successfully sent the data, use the Ledger Import function to import the created journal into SunSystems. "]
[]
[]
[null,"Step 1"]
[]
[null,"Header Information"]
{"$rows_left_out":26}
{"sheet":"Ls_XLB_WorkbookFile","index":6,"n_rows":0,"n_cols":0,"rows_kept":0,"cut":false,"hidden":true,"merged":[]}

{"sheet":"Ls_AgXLB_WorkbookFile","index":7,"n_rows":5,"n_cols":3,"rows_kept":5,"cut":false,"hidden":true,"merged":[]}
[">>Staff Expense Claim Import",">'lsd",">'[LASATA SETUP FILE]\r\nDate=2015-06-01 09:13:30\r\nFileType=Agora XML SendData\r\nVersion=0\r\nBuffer=\r\n@Agora XML SendData:Str=@STARTBLOCK\r\nsetupFileVersion:2=1\r\nAbortIfErrorsExist:2=1\r\nAppendFile:2=0\r\nRunScript:2=1\r\nDatabaseOrig:8=\r\nDefinitionName:8=Ledger Import\r\nDefinitionVersion:4=2\r\nErrorReference:8=I23\r\nCommentReference:8=I24\r\nMatrixSend:11=0\r\nSkipBlanks:11=-1\r\nCSVDelimeter:8=\r\nCSVIncludeHeader:2=0\r\nMatrixReplicatorFieldOverrideNodePath:8=/LI Header/LI Detail/PERD\r\nDriverFieldOverrideNodePath:8=/LI Header/CREATED_DATETIME\r\nLanguage:8=\r\nOutputFileNameOrig:8=\r\nSetupFileNameOrig:8=\r\nSetupFileType:2=2\r\nShowMessages:2=1\r\nWorkBookSetupFileOrig:8=Staff Expense Claim Import\r\nLayoutIdetifierColumn:8=A2\r\nProduct:8=SS5\r\nSuperFieldKey:8=DbC\r\nSuperFieldValue:8=$C$22\r\nFieldValueCodePath:8=/LI Header/LI Detail/ACNT_CODE\r\nFieldValueValue:8=B8\r\nFieldValueCodePath:8=/LI Header/LI Detail/PERD\r\nFieldValueValue:8=PA  +0\r\nFieldValueCodePath:8=/LI Header/LI Detail/TXN_DATETIME\r\nFieldValueValue:8=$C$25\r\nFieldValueCodePath:8=/LI Header/LI Detail/JNL_SRCE\r\nFieldValueValue:8=$C$21\r\nFieldValueCodePath:8=/LI Header/LI Detail/TXN_REF\r\nFieldValueValue:8=$C$24\r\nFieldValueCodePath:8=/LI Header/LI Detail/AMT\r\nFieldValueValue:8=H8\r\nFieldValueCodePath:8=/LI Header/LI Detail/DESCR\r\nFieldValueValue:8=K8\r\nFieldValueCodePath:8=/LI Header/LI Detail/DR_CR_IND\r\nFieldValueValue:8=\r\nFieldValueCodePath:8=/LI Header/LI Detail/MEMO_AMT\r\nFieldValueValue:8=L8\r\nFieldValueCodePath:8=/LI Header/LI Detail/ANL_CODE_T0\r\nFieldValueValue:8=C8\r\nFieldValueCodePath:8=/LI Header/LI Detail/ANL_CODE_T1\r\nFieldValueValue:8=D8\r\nFieldValueCodePath:8=/LI Header/LI Detail/ANL_CODE_T2\r\nFieldValueValue:8=NA\r\nFieldValueCodePath:8=/LI Header/LI Detail/ANL_CODE_T3\r\nFieldValueValue:8=E8\r\nFieldValueCodePath:8=/LI Header/LI Detail/ANL_CODE_T4\r\nFieldValueValue:8=F8\r\nFieldValueCodePath:8=/LI Header/LI Detail/ANL_CODE_T5\r\nFieldValueValue:8=G8\r\nFieldValueCodePath:8=/LI Header/LI Detail/ANL_CODE_T6\r\nFieldValueValue:8=I8\r\nFieldValueCodePath:8=/LI Header/LI Detail/LI Detail LAD/PSTG_HDR_ID\r\nFieldValueValue:8=\r\nFieldValueCodePath:8=/LI Header/LI Detail/LI Detail LAD/GNRL_DESCR_02\r\nFieldValueValue:8=M8\r\nFieldValueCodePath:8=/LI Header/LI Detail/LI Detail LAD/GNRL_DESCR_03\r\nFieldValueValue:8=N8\r\nFieldValueCodePath:8=/LI Header/LI Detail/LI Detail LAD/GNRL_1_DATETIME\r\nFieldValueValue:8=O8\r\nFieldValueCodePath:8=/LI Header/LI Detail/LI Detail LAD/GNRL_2_DATETIME\r\nFieldValueValue:8=P8\r\nFieldValueCodePath:8=/LI Header/CREATED_DATETIME\r\nFieldValueValue:8=DATE \r\nFieldValueCodePath:8=/LI Header/DESCR\r\nFieldValueValue:8=$C$24\r\nFieldValueCodePath:8=/LI Header/POST_TYPE\r\nFieldValueValue:8=2\r\nFieldValueCodePath:8=/LI Header/POST_WRITE_TO_HOLD\r\nFieldValueValue:8=N\r\nFieldValueCodePath:8=/LI Header/POST_ROUGH_BOOK\r\nFieldValueValue:8=N\r\nFieldValueCodePath:8=/LI Header/POST_ALLOW_BAL_TRANS\r\nFieldValueValue:8=0\r\nFieldValueCodePath:8=/LI Header/POST_RPT_ERR_ONLY\r\nFieldValueValue:8=Y\r\nFieldValueCodePath:8=/LI Header/POST_RPT_FMT\r\nFieldValueValue:8=Z_LIALL\r\nFieldValueCodePath:8=/LI Header/POST_SUPPRESS_SUB_MSG\r\nFieldValueValue:8=N\r\nFieldValueCodePath:8=/LI Header/JRNL_TYPE\r\nFieldValueValue:8=$C$23\r\nFieldValueCodePath:8=/LI Header/LI Detail/ANL_CODE_T8\r\nFieldValueValue:8=\r\nFieldValueCodePath:8=/LI Header/LI Detail/ANL_CODE_T7\r\nFieldValueValue:8=J8\r\nFieldValueCodePath:8=/LI Header/LI Detail/LI Detail LAD/GNRL_DESCR_12\r\nFieldValueValue:8=$C$26\r\nFieldValueCodePath:8=/LI Header/LI Detail/LI Detail LAD/GNRL_5_DATETIME\r\nFieldValueValue:8=$F$26\r\nParam1:8=@START\r\nInternalName:8=IsCheckBalances\r\nValueFrom:8=N\r\nValueTo:8=\r\n\r\n@END\r\nZeroRecordCount:3=0\r\nNonZeroRecordCount:3=0\r\n\r\n@ENDBLOCK\r\n"]
[">>Import Expense Claim Form",">'axb",">'[LASATA SETUP FILE]\r\nDate=2014-05-27 18:10:31\r\nFileType=Agora XLB MacroBuilder\r\nVersion=0\r\nBuffer=\r\n@settngMacroName:Str=Expense_Import\r\n@settngMacroButtonCaption:Str=Send Data to SunSystems\r\n@settngMacroShortcutKey:Str=\r\n@recipeStep_RunDataSend_52718094465000:Str=P0=Staff Expense Claim Import,P1=,P2=\r\n@filenmSetupfile:Str=\r\n@filenmWorkbookSetupFile:Str=Import Expense Claim Form\r\n"]
[">>Refresh worksheet",">'axb",">'[LASATA SETUP FILE]\r\nDate=2014-05-27 18:17:44\r\nFileType=Agora XLB MacroBuilder\r\nVersion=0\r\nBuffer=\r\n@settngMacroName:Str=Recalculate_Import\r\n@settngMacroButtonCaption:Str=Check Supplier Account\r\n@settngMacroShortcutKey:Str=\r\n@recipeStep_RecalculateWorksheet_52718165605000:Str=P0=[Expenses Form Rebuild 27-05-14.xlsm]Import,P1=,P2=\r\n@filenmSetupfile:Str=\r\n@filenmWorkbookSetupFile:Str=Refresh worksheet\r\n"]
[">>Import_Expenses",">'axb",">'[LASATA SETUP FILE]\r\nDate=2014-05-27 18:46:31\r\nFileType=Agora XLB MacroBuilder\r\nVersion=0\r\nBuffer=\r\n@settngMacroName:Str=Import_Expenses\r\n@settngMacroButtonCaption:Str=Send Data to SunSystems\r\n@settngMacroShortcutKey:Str=\r\n@recipeStep_RunDataSend_52718460610000:Str=P0=Staff Expense Claim Import,P1=,P2=\r\n@filenmSetupfile:Str=\r\n@filenmWorkbookSetupFile:Str=Import_Expenses\r\n"]
[">>Update Import File",">'axb",">'[LASATA SETUP FILE]\r\nDate=2014-05-28 10:26:25\r\nFileType=Agora XLB MacroBuilder\r\nVersion=0\r\nBuffer=\r\n@settngMacroName:Str=Recalculate_Worksheet\r\n@settngMacroButtonCaption:Str=Update Import File\r\n@settngMacroShortcutKey:Str=\r\n@recipeStep_RecalculateWorksheet_52810254359000:Str=P0=[Expenses Form Rebuild 27-05-14.xlsm]Import,P1=,P2=\r\n@filenmSetupfile:Str=\r\n@filenmWorkbookSetupFile:Str=Update Import File\r\n"]